Target
Epithelial discoidin domain-containing receptor 1
Ligand
BDBM13216
Substrate
biotinylated affinity ligand
Meas. Tech.
Kinase Inhibitor Selectivity Profiling Assay
pH
7.4±n/a
Temperature
298.15±n/a K
Kd
0.69±n/a nM
Citation
 PubChem, PC Kinase Inhibitor Selectivity Profiling Assay PubChem Bioassay (2008)[AID] 
Target
Name:
Epithelial discoidin domain-containing receptor 1
Synonyms:
CAK DDR1_HUMAN Discoidin domain-containing receptor 1 (DDR1) EDDR1 Epithelial discoidin domain receptor 1 (DDR1) Epithelial discoidin domain-containing receptor 1 (DDR1) Mammary carcinoma kinase 10 NTRK4 Protein-tyrosine kinase RTK 6 TRKE | Tyrosine-protein kinase CAK
Type:
Tyrosine-protein kinase
Mol. Mass.:
101130.02
Organism:
Homo sapiens (Human)
Description:
Q08345
Residue:
913
  
Inhibitor
Name:
BDBM13216
Synonyms:
BMS-354825 DASATINIB N-(2-chloro-6-methylphenyl)-2-({6-[4-(2-hydroxyethyl)piperazin-1-yl]-2-methylpyrimidin-4-yl}amino)-1,3-thiazole-5-carboxamide US20230348453, Compound A8 med.21724, Compound Dasatinib
Type:
Small organic molecule
Emp. Form.:
C22H26ClN7O2S
Mol. Mass.:
488.006
SMILES:
Cc1nc(Nc2ncc(s2)C(=O)Nc2c(C)cccc2Cl)cc(n1)N1CCN(CCO)CC1
:
Substrate
Name:
biotinylated affinity ligand
Synonyms:
Type:
Mol. Mass.:
358.43
Organism:
Description:
Residue:
3
NA