Target
E3 ubiquitin-protein ligase Mdm2
Ligand
BDBM31285
Substrate
Fl 9mer
Meas. Tech.
Fluorescent Peptide Displacement Assay
pH
7.5±n/a
Temperature
296.15±n/a K
Kd
80±n/a nM
Citation
 Grasberger, BLLu, TSchubert, CParks, DJCarver, TEKoblish, HKCummings, MDLaFrance, LVMilkiewicz, KLCalvo, RRMaguire, DLattanze, JFranks, CFZhao, SRamachandren, KBylebyl, GRZhang, MManthey, CLPetrella, ECPantoliano, MWDeckman, ICSpurlino, JCMaroney, ACTomczuk, BEMolloy, CJBone, RF Discovery and cocrystal structure of benzodiazepinedione HDM2 antagonists that activate p53 in cells. J Med Chem 48:909-12 (2005)  
Target
Name:
E3 ubiquitin-protein ligase Mdm2
Synonyms:
Double minute 2 protein E3 ubiquitin-protein ligase Mdm2 (p53-binding protein Mdm2) Human Double Minute 2 (HDM2) MDM2-MDMX p53-Binding Protein MDM2 | p53-binding protein
Type:
Oncoprotein
Mol. Mass.:
55196.54
Organism:
Homo sapiens (Human)
Description:
Q00987
Residue:
491
  
Inhibitor
Name:
BDBM31285
Synonyms:
BMCL163310 Compound 1 benzodiazepinedione, 1
Type:
Small organic molecule
Emp. Form.:
C23H15Cl2IN2O4
Mol. Mass.:
581.187
SMILES:
OC(=O)[C@@H](N1[C@@H](c2ccc(Cl)cc2)C(=O)Nc2ccc(I)cc2C1=O)c1ccc(Cl)cc1
:
Substrate
Name:
Fl 9mer
Synonyms:
Type:
fluorescent peptide
Mol. Mass.:
2263.48
Organism:
Description:
Residue:
18
FLRESCEINFMDYWEGLN