Target
Dimer of Gag-Pol polyprotein [489-587]
Ligand
BDBM719
Substrate
HIV-1 Protease substrate
Meas. Tech.
Protease Inhibition Assay
pH
6±n/a
Temperature
310.15±n/a K
Ki
0.088±n/a nM
Citation
 Mimoto, TKato, RTakaku, HNojima, STerashima, KMisawa, SFukazawa, TUeno, TSato, HShintani, MKiso, YHayashi, H Structure-activity relationship of small-sized HIV protease inhibitors containing allophenylnorstatine. J Med Chem 42:1789-802 (1999)  
Target
Name:
Dimer of Gag-Pol polyprotein [489-587]
Synonyms:
HIV-1 Protease
Type:
Protein Complex
Mol. Mass.:
Description:
Components:
This complex has 2 components.
Component 1
Name:
Gag-Pol polyprotein [489-587]
Synonyms:
HIV protease HIV-1 Protease chain A POL_HV1N5 | gag-pol
Type:
Enzyme Subunit
Mol. Mass.:
10822.21
Organism:
Human immunodeficiency virus type 1
Description:
P12497[489-587]
Residue:
99
  
Component 2
Name:
Gag-Pol polyprotein [489-587]
Synonyms:
HIV protease HIV-1 Protease chain A POL_HV1N5 | gag-pol
Type:
Enzyme Subunit
Mol. Mass.:
10822.21
Organism:
Human immunodeficiency virus type 1
Description:
P12497[489-587]
Residue:
99
  
Inhibitor
Name:
BDBM719
Synonyms:
(4R)-N-tert-butyl-3-[(2S,3S)-2-hydroxy-3-[(2R)-2-[2-(isoquinolin-5-yloxy)acetamido]-3-(methylsulfanyl)propanamido]-4-phenylbutanoyl]-5,5-dimethyl-1,3-thiazolidine-4-carboxamide KNI-227
Type:
Small organic molecule
Emp. Form.:
C35H45N5O6S2
Mol. Mass.:
695.892
SMILES:
CSC[C@H](NC(=O)COc1cccc2cnccc12)C(=O)N[C@@H](Cc1ccccc1)[C@H](O)C(=O)N1CSC(C)(C)[C@H]1C(=O)NC(C)(C)C
:
Substrate
Name:
HIV-1 Protease substrate
Synonyms:
Type:
Peptide
Mol. Mass.:
2535.82
Organism:
Synthetic peptide
Description:
Residue:
22