Target
Dual specificity protein phosphatase 6
Ligand
BDBM31759
Substrate
3-O-methylfluorescein phosphate (OMFP)
Meas. Tech.
In Vitro MKP-3 Dose Response Assay for SAR Study
pH
7±n/a
Temperature
296.15±n/a K
IC50
5100±n/a nM
Citation
 PubChem, PC In Vitro MKP-3 Dose Response Assay for SAR Study PubChem Bioassay (2008)[AID] 
Target
Name:
Dual specificity protein phosphatase 6
Synonyms:
DUS6_RAT MAP kinase phosphatase 3 Mitogen-activated protein kinase phosphatase 3 | Mkp3
Type:
Enzyme
Mol. Mass.:
42303.19
Organism:
Rattus norvegicus
Description:
gi_16758752
Residue:
381
  
Inhibitor
Name:
BDBM31759
Synonyms:
2-[5-[(Z)-(3-bromanyl-8-oxidanylidene-[1,3]thiazolo[4,5]imidazo[1,2-b]pyridin-7-ylidene)methyl]furan-2-yl]benzoic acid 2-[5-[(Z)-(3-bromo-8-oxo-7-thiazolo[4,5]imidazo[1,2-b]pyridinylidene)methyl]-2-furanyl]benzoic acid MLS-0090801.0001 | cid_1357397
Type:
Small organic molecule
Emp. Form.:
C20H10BrN3O4S
Mol. Mass.:
468.28
SMILES:
OC(=O)c1ccccc1-c1ccc(\C=c2/sc3nc4cc(Br)cnc4n3c2=O)o1
:
Substrate
Name:
3-O-methylfluorescein phosphate (OMFP)
Synonyms:
Type:
Mol. Mass.:
358.43
Organism:
Description:
Residue:
3
NA