Target
Serine/threonine-protein kinase TBK1
Ligand
BDBM397639
Substrate
Meas. Tech.
Inhibition Assay
IC50
7.94±n/a nM
Citation
 Bigi, SKeung, WSwann, SVu, PHWoodhead, SJGangloff, AR Heteroarylamide inhibitors of TBK1 US Patent  US9994547 Publication Date 6/12/2018 
Target
Name:
Serine/threonine-protein kinase TBK1
Synonyms:
NAK Protein cereblon/Serine/threonine-protein kinase TBK1 TANK-binding kinase 1 (TBK-1) TBK1 | TBK1_HUMAN
Type:
protein
Mol. Mass.:
83645.20
Organism:
Homo sapiens (Human)
Description:
Q9UHD2
Residue:
729
  
Inhibitor
Name:
BDBM397639
Synonyms:
US9994547, Example 8.0
Type:
Small organic molecule
Emp. Form.:
C21H22F2N6O2
Mol. Mass.:
428.4352
SMILES:
CN(C)C(=O)C(CC(F)F)Nc1cc(ccc1C#N)-c1cnc(NC(=O)C2CC2)cn1
: