Target
Kappa-type opioid receptor
Ligand
BDBM397980
Substrate
Meas. Tech.
Radioligand dose-displacement Binding Assay
Ki
>20000±n/a nM
Citation
 Tafesse, L 10-substituted morphinan hydantoins US Patent  US9994571 Publication Date 6/12/2018 
Target
Name:
Kappa-type opioid receptor
Synonyms:
K-OR-1 Kappa-opioid receptor (KOR) Kappa-type opioid receptor (KOR) OPIATE Kappa OPRK1 kappa opioid receptor (KOR)
Type:
G Protein-Coupled Receptor (GPCR)
Mol. Mass.:
42648.76
Organism:
Homo sapiens (Human)
Description:
P41145
Residue:
380
  
Inhibitor
Name:
BDBM397980
Synonyms:
US9994571, Compound 8
Type:
Small organic molecule
Emp. Form.:
C23H25N3O6
Mol. Mass.:
439.4611
SMILES:
COc1ccc2c3c1O[C@H]1[C@]4(CC[C@@]5(O)[C@H](N(CC6CC6)CC[C@]315)C2=O)NC(=O)NC4=O
: