Target
Mu-type opioid receptor
Ligand
BDBM397982
Substrate
Meas. Tech.
Radioligand dose-displacement Binding Assay
Ki
>20000±n/a nM
Citation
 Tafesse, L 10-substituted morphinan hydantoins US Patent  US9994571 Publication Date 6/12/2018 
Target
Name:
Mu-type opioid receptor
Synonyms:
M-OR-1 MOR-1 MUOR1 Mu opiate receptor OPRM1 hMOP | mu-type opioid receptor isoform MOR-1
Type:
G Protein-Coupled Receptor (GPCR)
Mol. Mass.:
44789.51
Organism:
Homo sapiens (Human)
Description:
P35372
Residue:
400
  
Inhibitor
Name:
BDBM397982
Synonyms:
US9994571, Compound 9
Type:
Small organic molecule
Emp. Form.:
C23H27N3O6
Mol. Mass.:
441.477
SMILES:
COc1ccc2[C@@H](O)[C@H]3N(CC4CC4)CC[C@@]45[C@@H](Oc1c24)[C@]1(CC[C@@]35O)NC(=O)NC1=O
: