Target
Mu-type opioid receptor
Ligand
BDBM397985
Substrate
Meas. Tech.
Radioligand dose-displacement Binding Assay
Ki
>20000±n/a nM
Citation
 Tafesse, L 10-substituted morphinan hydantoins US Patent  US9994571 Publication Date 6/12/2018 
Target
Name:
Mu-type opioid receptor
Synonyms:
M-OR-1 MOR-1 MUOR1 Mu opiate receptor OPRM1 hMOP | mu-type opioid receptor isoform MOR-1
Type:
G Protein-Coupled Receptor (GPCR)
Mol. Mass.:
44789.51
Organism:
Homo sapiens (Human)
Description:
P35372
Residue:
400
  
Inhibitor
Name:
BDBM397985
Synonyms:
US9994571, Compound 10
Type:
Small organic molecule
Emp. Form.:
C23H29N3O4
Mol. Mass.:
411.4941
SMILES:
COc1ccc2[C@@H](O)[C@@H]3[C@@H]4CC[C@@]5(C[C@]4(CCN3CC3CC3)c2c1)NC(=O)NC5=O
: