Target
Kappa-type opioid receptor
Ligand
BDBM397985
Substrate
Meas. Tech.
Radioligand dose-displacement Binding Assay
Ki
3583±647.2 nM
Citation
 Tafesse, L 10-substituted morphinan hydantoins US Patent  US9994571 Publication Date 6/12/2018 
Target
Name:
Kappa-type opioid receptor
Synonyms:
K-OR-1 Kappa-opioid receptor (KOR) Kappa-type opioid receptor (KOR) OPIATE Kappa OPRK1 kappa opioid receptor (KOR)
Type:
G Protein-Coupled Receptor (GPCR)
Mol. Mass.:
42648.76
Organism:
Homo sapiens (Human)
Description:
P41145
Residue:
380
  
Inhibitor
Name:
BDBM397985
Synonyms:
US9994571, Compound 10
Type:
Small organic molecule
Emp. Form.:
C23H29N3O4
Mol. Mass.:
411.4941
SMILES:
COc1ccc2[C@@H](O)[C@@H]3[C@@H]4CC[C@@]5(C[C@]4(CCN3CC3CC3)c2c1)NC(=O)NC5=O
: