Target
Mu-type opioid receptor
Ligand
BDBM397986
Substrate
Meas. Tech.
Radioligand dose-displacement Binding Assay
Ki
>20000±n/a nM
Citation
 Tafesse, L 10-substituted morphinan hydantoins US Patent  US9994571 Publication Date 6/12/2018 
Target
Name:
Mu-type opioid receptor
Synonyms:
M-OR-1 MOR-1 MUOR1 Mu opiate receptor OPRM1 hMOP | mu-type opioid receptor isoform MOR-1
Type:
G Protein-Coupled Receptor (GPCR)
Mol. Mass.:
44789.51
Organism:
Homo sapiens (Human)
Description:
P35372
Residue:
400
  
Inhibitor
Name:
BDBM397986
Synonyms:
US9994571, Compound 11
Type:
Small organic molecule
Emp. Form.:
C20H23N3O5
Mol. Mass.:
385.4137
SMILES:
COc1ccc2C(=O)[C@H]3N(C)CC[C@@]4(C[C@]5(CC[C@@]34O)NC(=O)NC5=O)c2c1
: