Target
Kappa-type opioid receptor
Ligand
BDBM397989
Substrate
Meas. Tech.
Radioligand dose-displacement Binding Assay
Ki
12.2±0.61 nM
Citation
 Tafesse, L 10-substituted morphinan hydantoins US Patent  US9994571 Publication Date 6/12/2018 
Target
Name:
Kappa-type opioid receptor
Synonyms:
K-OR-1 Kappa-opioid receptor (KOR) Kappa-type opioid receptor (KOR) OPIATE Kappa OPRK1 kappa opioid receptor (KOR)
Type:
G Protein-Coupled Receptor (GPCR)
Mol. Mass.:
42648.76
Organism:
Homo sapiens (Human)
Description:
P41145
Residue:
380
  
Inhibitor
Name:
BDBM397989
Synonyms:
US9994571, Compound 13
Type:
Small organic molecule
Emp. Form.:
C22H25N3O5
Mol. Mass.:
411.451
SMILES:
Oc1ccc2C(=O)[C@H]3N(CC4CC4)CC[C@@]4(C[C@]5(CC[C@@]34O)NC(=O)NC5=O)c2c1
: