Target
Kappa-type opioid receptor
Ligand
BDBM397990
Substrate
Meas. Tech.
Radioligand dose-displacement Binding Assay
Ki
78.1±21.0 nM
Citation
 Tafesse, L 10-substituted morphinan hydantoins US Patent  US9994571 Publication Date 6/12/2018 
Target
Name:
Kappa-type opioid receptor
Synonyms:
K-OR-1 Kappa-opioid receptor (KOR) Kappa-type opioid receptor (KOR) OPIATE Kappa OPRK1 kappa opioid receptor (KOR)
Type:
G Protein-Coupled Receptor (GPCR)
Mol. Mass.:
42648.76
Organism:
Homo sapiens (Human)
Description:
P41145
Residue:
380
  
Inhibitor
Name:
BDBM397990
Synonyms:
US9994571, Compound 14
Type:
Small organic molecule
Emp. Form.:
C22H27N3O5
Mol. Mass.:
413.4669
SMILES:
O[C@H]1[C@H]2N(CC3CC3)CC[C@@]3(C[C@]4(CC[C@@]23O)NC(=O)NC4=O)c2cc(O)ccc12
: