Target
Mu-type opioid receptor
Ligand
BDBM397991
Substrate
Meas. Tech.
Radioligand dose-displacement Binding Assay
Ki
15408±3126 nM
Citation
 Tafesse, L 10-substituted morphinan hydantoins US Patent  US9994571 Publication Date 6/12/2018 
Target
Name:
Mu-type opioid receptor
Synonyms:
M-OR-1 MOR-1 MUOR1 Mu opiate receptor OPRM1 hMOP | mu-type opioid receptor isoform MOR-1
Type:
G Protein-Coupled Receptor (GPCR)
Mol. Mass.:
44789.51
Organism:
Homo sapiens (Human)
Description:
P35372
Residue:
400
  
Inhibitor
Name:
BDBM397991
Synonyms:
US9994571, Compound 15
Type:
Small organic molecule
Emp. Form.:
C22H23N3O6
Mol. Mass.:
425.4345
SMILES:
Oc1ccc2c3c1O[C@H]1[C@]4(CC[C@@]5(O)[C@H](N(CC6CC6)CC[C@]315)C2=O)NC(=O)NC4=O
: