Target
Mu-type opioid receptor
Ligand
BDBM397992
Substrate
Meas. Tech.
Radioligand dose-displacement Binding Assay
Ki
>20000±n/a nM
Citation
 Tafesse, L 10-substituted morphinan hydantoins US Patent  US9994571 Publication Date 6/12/2018 
Target
Name:
Mu-type opioid receptor
Synonyms:
M-OR-1 MOR-1 MUOR1 Mu opiate receptor OPRM1 hMOP | mu-type opioid receptor isoform MOR-1
Type:
G Protein-Coupled Receptor (GPCR)
Mol. Mass.:
44789.51
Organism:
Homo sapiens (Human)
Description:
P35372
Residue:
400
  
Inhibitor
Name:
BDBM397992
Synonyms:
US9994571, Compound 16
Type:
Small organic molecule
Emp. Form.:
C22H25N3O6
Mol. Mass.:
427.4504
SMILES:
O[C@H]1[C@H]2N(CC3CC3)CC[C@@]34[C@@H](Oc5c3c1ccc5O)[C@]1(CC[C@@]24O)NC(=O)NC1=O
: