Target
High affinity nerve growth factor receptor
Ligand
BDBM398794
Substrate
Meas. Tech.
TrkA Omnia Assay
IC50
<100±n/a nM
Citation
 Allen, SAndrews, SWBlake, JFCondroski, KRHaas, JHuang, LJiang, YKercher, TKolakowski, GRSeo, J Pyrrolidinyl urea, pyrrolidinyl thiourea and pyrrolidinyl guanidine compounds as TrkA kinase inhibitors US Patent  US10323022 Publication Date 6/18/2019 
Target
Name:
High affinity nerve growth factor receptor
Synonyms:
2.7.10.1 NTRK1 NTRK1_HUMAN Neurotrophic tyrosine kinase receptor type 1 Synonyms=MTC TRK1-transforming tyrosine kinase protein TRKA GN Trk-A Tropomyosin-related kinase A Tyrosine kinase receptor Tyrosine kinase receptor A Tyrosine kinase receptor A (Trk-A) gp140trk | p140-TrkA
Type:
Mol. Mass.:
87498.18
Organism:
Homo sapiens (Human)
Description:
P04629
Residue:
796
  
Inhibitor
Name:
BDBM398794
Synonyms:
US10323022, Example 271
Type:
Small organic molecule
Emp. Form.:
C29H34F3N5O4
Mol. Mass.:
573.6066
SMILES:
Cc1c(OC[C@H]2COC(C)(C)O2)nn(c1NC(=O)N[C@H]1CN(CC(F)(F)F)C[C@@H]1c1ccccc1)-c1ccccc1
: