Target
High affinity nerve growth factor receptor
Ligand
BDBM398813
Substrate
Meas. Tech.
TrkA Omnia Assay
IC50
<100±n/a nM
Citation
 Allen, SAndrews, SWBlake, JFCondroski, KRHaas, JHuang, LJiang, YKercher, TKolakowski, GRSeo, J Pyrrolidinyl urea, pyrrolidinyl thiourea and pyrrolidinyl guanidine compounds as TrkA kinase inhibitors US Patent  US10323022 Publication Date 6/18/2019 
Target
Name:
High affinity nerve growth factor receptor
Synonyms:
2.7.10.1 NTRK1 NTRK1_HUMAN Neurotrophic tyrosine kinase receptor type 1 Synonyms=MTC TRK1-transforming tyrosine kinase protein TRKA GN Trk-A Tropomyosin-related kinase A Tyrosine kinase receptor Tyrosine kinase receptor A Tyrosine kinase receptor A (Trk-A) gp140trk | p140-TrkA
Type:
Mol. Mass.:
87498.18
Organism:
Homo sapiens (Human)
Description:
P04629
Residue:
796
  
Inhibitor
Name:
BDBM398813
Synonyms:
1-((3S,4R)-4-(3,4- difluorophenyl)-1-(2- methoxyethyl)pyrrolidin-3-yl)- 3-(3-((R)-2-hydroxypropyl)-4- methyl-1-phenyl-1H-pyrazol- 5-yl)urea | US10323022, Example 290
Type:
Small organic molecule
Emp. Form.:
C27H33F2N5O3
Mol. Mass.:
513.5794
SMILES:
COCCN1C[C@@H](NC(=O)Nc2c(C)c(C[C@@H](C)O)nn2-c2ccccc2)[C@@H](C1)c1ccc(F)c(F)c1
: