Target
High affinity nerve growth factor receptor
Ligand
BDBM398834
Substrate
Meas. Tech.
TrkA Omnia Assay
IC50
<100±n/a nM
Citation
 Allen, SAndrews, SWBlake, JFCondroski, KRHaas, JHuang, LJiang, YKercher, TKolakowski, GRSeo, J Pyrrolidinyl urea, pyrrolidinyl thiourea and pyrrolidinyl guanidine compounds as TrkA kinase inhibitors US Patent  US10323022 Publication Date 6/18/2019 
Target
Name:
High affinity nerve growth factor receptor
Synonyms:
2.7.10.1 NTRK1 NTRK1_HUMAN Neurotrophic tyrosine kinase receptor type 1 Synonyms=MTC TRK1-transforming tyrosine kinase protein TRKA GN Trk-A Tropomyosin-related kinase A Tyrosine kinase receptor Tyrosine kinase receptor A Tyrosine kinase receptor A (Trk-A) gp140trk | p140-TrkA
Type:
Mol. Mass.:
87498.18
Organism:
Homo sapiens (Human)
Description:
P04629
Residue:
796
  
Inhibitor
Name:
BDBM398834
Synonyms:
1-((3S,4R)-4-(3,4- difluorophenyl)-1-(2- methoxyethyl)pyrrolidin-3-yl)- 3-(4-ethyl-1'-methyl-1-phenyl- 1H,1'H-[3,4'-bipyrazol]-5- yl)urea | US10323022, Example 311
Type:
Small organic molecule
Emp. Form.:
C29H33F2N7O2
Mol. Mass.:
549.6148
SMILES:
CCc1c(NC(=O)N[C@@H]2CN(CCOC)C[C@H]2c2ccc(F)c(F)c2)n(nc1-c1cnn(C)c1)-c1ccccc1
: