Target
High affinity nerve growth factor receptor
Ligand
BDBM398843
Substrate
Meas. Tech.
TrkA Omnia Assay
IC50
<100±n/a nM
Citation
 Allen, SAndrews, SWBlake, JFCondroski, KRHaas, JHuang, LJiang, YKercher, TKolakowski, GRSeo, J Pyrrolidinyl urea, pyrrolidinyl thiourea and pyrrolidinyl guanidine compounds as TrkA kinase inhibitors US Patent  US10323022 Publication Date 6/18/2019 
Target
Name:
High affinity nerve growth factor receptor
Synonyms:
2.7.10.1 NTRK1 NTRK1_HUMAN Neurotrophic tyrosine kinase receptor type 1 Synonyms=MTC TRK1-transforming tyrosine kinase protein TRKA GN Trk-A Tropomyosin-related kinase A Tyrosine kinase receptor Tyrosine kinase receptor A Tyrosine kinase receptor A (Trk-A) gp140trk | p140-TrkA
Type:
Mol. Mass.:
87498.18
Organism:
Homo sapiens (Human)
Description:
P04629
Residue:
796
  
Inhibitor
Name:
BDBM398843
Synonyms:
1-((3S,4R)-4-(4-fluorophenyl)- 1-(2-methoxyethyl)pyrrolidin- 3-yl)-3-(1-(2-fluorophenyl)- 1',4-dimethyl-1H,1'H-[3,4'- bipyrazol]-5-yl)urea | US10323022, Example 320
Type:
Small organic molecule
Emp. Form.:
C28H31F2N7O2
Mol. Mass.:
535.5882
SMILES:
COCCN1C[C@@H](NC(=O)Nc2c(C)c(nn2-c2ccccc2F)-c2cnn(C)c2)[C@@H](C1)c1ccc(F)cc1
: