Target
Coagulation factor XI
Ligand
BDBM32848
Substrate
Boc-Glu-Ala-Arg-AMC
Meas. Tech.
Factor XIa 1536 HTS Dose Response Confirmation
pH
7.4±n/a
Temperature
296.15±n/a K
IC50
2292.97±351.381258 nM
Citation
 PubChem, PC Factor XIa 1536 HTS Dose Response Confirmation PubChem Bioassay (2008)[AID] 
Target
Name:
Coagulation factor XI
Synonyms:
Coagulation factor XIa Coagulation factor XIa light chain FA11_HUMAN Factor XIa PTA | Plasma thromboplastin antecedent
Type:
Enzyme
Mol. Mass.:
70130.58
Organism:
Homo sapiens (Human)
Description:
P03951
Residue:
625
  
Inhibitor
Name:
BDBM32848
Synonyms:
(5,5-dimethyl-3-oxidanylidene-cyclohexen-1-yl) 4-methylbenzoate 4-methylbenzoic acid (3-keto-5,5-dimethyl-cyclohexen-1-yl) ester 5,5-dimethyl-3-oxo-1-cyclohexenyl 4-methylbenzenecarboxylate SMR000179463 | cid_1474654
Type:
Small organic molecule
Emp. Form.:
C16H18O3
Mol. Mass.:
258.3123
SMILES:
Cc1ccc(cc1)C(=O)OC1=CC(=O)CC(C)(C)C1
:
Substrate
Name:
Boc-Glu-Ala-Arg-AMC
Synonyms:
Type:
fluorescent substrate peptide
Mol. Mass.:
358.43
Organism:
Description:
Residue:
3
NA