Target
Bcl-2-related protein A1
Ligand
BDBM33082
Substrate
FITC-conjugated-Bim BH3 Peptide
Meas. Tech.
Multiplexed dose response screen for small molecule regulators of Bcl-2 family protein interactions, specifically Bim-Bfl-1.
pH
7.4±n/a
Temperature
277.15±n/a K
EC50
3200±n/a nM
Citation
 PubChem, PC Multiplexed dose response screen for small molecule regulators of Bcl-2 family protein interactions, specifically Bim-Bfl-1. PubChem Bioassay (2008)[AID] 
Target
Name:
Bcl-2-related protein A1
Synonyms:
B2LA1_HUMAN BCL2L5 Bcl-2-like protein 5 HBPA1 Protein BFL-1 | Protein GRS
Type:
Apoptosis regulator protein
Mol. Mass.:
20130.01
Organism:
Homo sapiens (Human)
Description:
Residue:
175
  
Inhibitor
Name:
BDBM33082
Synonyms:
1,4-diketo-3-(4-methylbenzyl)naphthalene-2-carboxylic acid ethyl ester MLS000532055 cid_2841620 ethyl 3-[(4-methylphenyl)methyl]-1,4-bis(oxidanylidene)naphthalene-2-carboxylate | ethyl 3-[(4-methylphenyl)methyl]-1,4-dioxonaphthalene-2-carboxylate
Type:
Small organic molecule
Emp. Form.:
C21H18O4
Mol. Mass.:
334.3652
SMILES:
CCOC(=O)C1=C(Cc2ccc(C)cc2)C(=O)c2ccccc2C1=O
:
Substrate
Name:
FITC-conjugated-Bim BH3 Peptide
Synonyms:
FITC-Ahx-DMRPEIWIAQELRRIGDEFNAYYAR-OH
Type:
FITC-labeled Peptide
Mol. Mass.:
3112.46
Organism:
Description:
Residue:
25