Target
Bcl-2-related protein A1
Ligand
BDBM33193
Substrate
FITC-conjugated-Bim BH3 Peptide
Meas. Tech.
Multiplexed dose response screen for small molecule regulators of Bcl-2 family protein interactions, specifically Bim-Bfl-1.
pH
7.4±n/a
Temperature
277.15±n/a K
EC50
8430±n/a nM
Citation
 PubChem, PC Multiplexed dose response screen for small molecule regulators of Bcl-2 family protein interactions, specifically Bim-Bfl-1. PubChem Bioassay (2008)[AID] 
Target
Name:
Bcl-2-related protein A1
Synonyms:
B2LA1_HUMAN BCL2L5 Bcl-2-like protein 5 HBPA1 Protein BFL-1 | Protein GRS
Type:
Apoptosis regulator protein
Mol. Mass.:
20130.01
Organism:
Homo sapiens (Human)
Description:
Residue:
175
  
Inhibitor
Name:
BDBM33193
Synonyms:
3,7-dibenzyl-8-(5-methyl-2-furyl)xanthine 8-(5-methyl-2-furanyl)-3,7-bis(phenylmethyl)purine-2,6-dione MLS000772379 cid_3306429
Type:
Small organic molecule
Emp. Form.:
C24H20N4O3
Mol. Mass.:
412.4406
SMILES:
Cc1ccc(o1)-c1nc2n(Cc3ccccc3)c(=O)[nH]c(=O)c2n1Cc1ccccc1
:
Substrate
Name:
FITC-conjugated-Bim BH3 Peptide
Synonyms:
FITC-Ahx-DMRPEIWIAQELRRIGDEFNAYYAR-OH
Type:
FITC-labeled Peptide
Mol. Mass.:
3112.46
Organism:
Description:
Residue:
25