Target
Non-receptor tyrosine-protein kinase TYK2 [V731I]
Ligand
BDBM399576
Substrate
Meas. Tech.
TYK2 JH2 Domain Binding Assay
Kd
5.5±n/a nM
Citation
 Greenwood, JRHarriman, GCLeit de Moradei, SMMasse, CEMcLean, THMondal, S TYK2 inhibitors and uses thereof US Patent  US10323036 Publication Date 6/18/2019 
Target
Name:
Non-receptor tyrosine-protein kinase TYK2 [V731I]
Synonyms:
JH2 domain (V731I) TYK2 (V731I) | TYK2_HUMAN
Type:
Enzyme Catalytic Domain
Mol. Mass.:
133680.06
Organism:
Homo sapiens (Human)
Description:
P29597[V731I]
Residue:
1187
  
Inhibitor
Name:
BDBM399576
Synonyms:
US10323036, Compound I-19 US11220508, Compound I-19
Type:
Small organic molecule
Emp. Form.:
C23H23N9O3
Mol. Mass.:
473.4872
SMILES:
COc1c(Nc2cc(Nc3cc(CO)ccn3)nc3[nH]n(C)c(=O)c23)cccc1-c1ncn(C)n1
: