Target
Non-receptor tyrosine-protein kinase TYK2 [V731I]
Ligand
BDBM399582
Substrate
Meas. Tech.
TYK2 JH2 Domain Binding Assay
Kd
0.3±n/a nM
Citation
 Greenwood, JRHarriman, GCLeit de Moradei, SMMasse, CEMcLean, THMondal, S TYK2 inhibitors and uses thereof US Patent  US10323036 Publication Date 6/18/2019 
Target
Name:
Non-receptor tyrosine-protein kinase TYK2 [V731I]
Synonyms:
JH2 domain (V731I) TYK2 (V731I) | TYK2_HUMAN
Type:
Enzyme Catalytic Domain
Mol. Mass.:
133680.06
Organism:
Homo sapiens (Human)
Description:
P29597[V731I]
Residue:
1187
  
Inhibitor
Name:
BDBM399582
Synonyms:
US10323036, Compound I-25 | US10793574, Compound I-25
Type:
Small organic molecule
Emp. Form.:
C23H20N10O2
Mol. Mass.:
468.4707
SMILES:
COc1c(Nc2cc(Nc3ccc(cn3)C#N)nc3[nH]n(C)c(=O)c23)cccc1-c1ncn(C)n1
: