Target
Non-receptor tyrosine-protein kinase TYK2 [V731I]
Ligand
BDBM399604
Substrate
Meas. Tech.
TYK2 JH2 Domain Binding Assay
Kd
0.75±n/a nM
Citation
 Greenwood, JRHarriman, GCLeit de Moradei, SMMasse, CEMcLean, THMondal, S TYK2 inhibitors and uses thereof US Patent  US10323036 Publication Date 6/18/2019 
Target
Name:
Non-receptor tyrosine-protein kinase TYK2 [V731I]
Synonyms:
JH2 domain (V731I) TYK2 (V731I) | TYK2_HUMAN
Type:
Enzyme Catalytic Domain
Mol. Mass.:
133680.06
Organism:
Homo sapiens (Human)
Description:
P29597[V731I]
Residue:
1187
  
Inhibitor
Name:
BDBM399604
Synonyms:
US10323036, Compound I-48 US11220508, Compound I-48
Type:
Small organic molecule
Emp. Form.:
C18H18FN5O3
Mol. Mass.:
371.3656
SMILES:
COc1c(F)cccc1Nc1cc(NC(=O)C2CC2)nc2[nH]n(C)c(=O)c12
: