Target
Sodium/bile acid cotransporter
Ligand
BDBM400105
Substrate
Meas. Tech.
HBV DNA Quantification Assay
EC50
199±n/a nM
Citation
 Du, JKaplan, JAKirschberg, TAKobayashi, TLazerwith, SELee, RAMedley, JWMitchell, MLMorganelli, PAPyun, HShevick, SLSquires, NHWatkins, WJ Substituted pyrrolizine compounds and uses thereof US Patent  US10328053 Publication Date 6/25/2019 
Target
Name:
Sodium/bile acid cotransporter
Synonyms:
Bile acid transporter NTCP_HUMAN | SLC10A1
Type:
PROTEIN
Mol. Mass.:
38131.81
Organism:
Homo sapiens (Human)
Description:
ChEMBL_838517
Residue:
349
  
Inhibitor
Name:
BDBM400105
Synonyms:
6-methyl-7-(2-((2-methyl-1-(methylamino)-1-oxopropan-2-yl)amino)-2-oxoacetyl)-N-(3,4,5-trifluorophenyl)-2,3-dihydro-1H-pyrrolizine-5-carboxamide US10874640, Compound 83 | US20230270719, Compound 83
Type:
Small organic molecule
Emp. Form.:
C22H23F3N4O4
Mol. Mass.:
464.4376
SMILES:
CNC(=O)C(C)(C)NC(=O)C(=O)c1c(C)c(C(=O)Nc2cc(F)c(F)c(F)c2)n2CCCc12
: