Target
Sodium/bile acid cotransporter
Ligand
BDBM400126
Substrate
Meas. Tech.
HBV DNA Quantification Assay
EC50
170±n/a nM
Citation
 Du, JKaplan, JAKirschberg, TAKobayashi, TLazerwith, SELee, RAMedley, JWMitchell, MLMorganelli, PAPyun, HShevick, SLSquires, NHWatkins, WJ Substituted pyrrolizine compounds and uses thereof US Patent  US10328053 Publication Date 6/25/2019 
Target
Name:
Sodium/bile acid cotransporter
Synonyms:
Bile acid transporter NTCP_HUMAN | SLC10A1
Type:
PROTEIN
Mol. Mass.:
38131.81
Organism:
Homo sapiens (Human)
Description:
ChEMBL_838517
Residue:
349
  
Inhibitor
Name:
BDBM400126
Synonyms:
N-(3-chloro-4-fluorophenyl)-6-methyl-7-(2-((1-(methylcarbamoyl)cyclopropyl)amino)-2-oxoacetyl)-2,3-dihydro-1H-pyrrolizine-5-carboxamide US10874640, Compound 105 | US20230270719, Compound 105
Type:
Small organic molecule
Emp. Form.:
C22H22ClFN4O4
Mol. Mass.:
460.886
SMILES:
CNC(=O)C1(CC1)NC(=O)C(=O)c1c(C)c(C(=O)Nc2ccc(F)c(Cl)c2)n2CCCc12
: