Target
Prothrombin
Ligand
BDBM33574
Substrate
Boc-Val-Pro-Arg-AMC
Meas. Tech.
Thrombin 1536 HTS Dose Response Confirmation
pH
7.5±n/a
Temperature
296.15±n/a K
IC50
3.42±n/a nM
Citation
 PubChem, PC Thrombin 1536 HTS Dose Response Confirmation PubChem Bioassay (2008)[AID] 
Target
Name:
Prothrombin
Synonyms:
Activation peptide fragment 1 Coagulation factor II Prothrombin precursor Thrombin heavy chain | Thrombin light chain
Type:
Protein
Mol. Mass.:
70029.57
Organism:
Homo sapiens (Human)
Description:
P00734
Residue:
622
  
Inhibitor
Name:
BDBM33574
Synonyms:
1-[3-(2-furanyl)-5-(phenylmethylthio)-1,2,4-triazol-1-yl]-1-propanone 1-[5-(benzylthio)-3-(2-furyl)-1,2,4-triazol-1-yl]propan-1-one 5-(benzylthio)-3-(2-furyl)-1-propionyl-1H-1,2,4-triazole SMR000075310 | cid_976504
Type:
Small organic molecule
Emp. Form.:
C16H15N3O2S
Mol. Mass.:
313.374
SMILES:
CCC(=O)n1nc(nc1SCc1ccccc1)-c1ccco1
:
Substrate
Name:
Boc-Val-Pro-Arg-AMC
Synonyms:
Type:
fluorogenic substrate
Mol. Mass.:
358.43
Organism:
Description:
Residue:
3
NA