Target
Prothrombin
Ligand
BDBM33439
Substrate
Boc-Val-Pro-Arg-AMC
Meas. Tech.
Thrombin 1536 HTS Dose Response Confirmation
pH
7.5±n/a
Temperature
296.15±n/a K
IC50
75.27±n/a nM
Citation
 PubChem, PC Thrombin 1536 HTS Dose Response Confirmation PubChem Bioassay (2008)[AID] 
Target
Name:
Prothrombin
Synonyms:
Activation peptide fragment 1 Coagulation factor II Prothrombin precursor Thrombin heavy chain | Thrombin light chain
Type:
Protein
Mol. Mass.:
70029.57
Organism:
Homo sapiens (Human)
Description:
P00734
Residue:
622
  
Inhibitor
Name:
BDBM33439
Synonyms:
1-(5-amino-3-pyridin-3-yl-1,2,4-triazol-1-yl)-2-phenylethanone 1-(phenylacetyl)-3-(3-pyridinyl)-1H-1,2,4-triazol-5-amine 1-[5-amino-3-(3-pyridyl)-1,2,4-triazol-1-yl]-2-phenyl-ethanone SMR000077068 | cid_971620
Type:
Small organic molecule
Emp. Form.:
C15H13N5O
Mol. Mass.:
279.2966
SMILES:
Nc1nc(nn1C(=O)Cc1ccccc1)-c1cccnc1
:
Substrate
Name:
Boc-Val-Pro-Arg-AMC
Synonyms:
Type:
fluorogenic substrate
Mol. Mass.:
358.43
Organism:
Description:
Residue:
3
NA