Target
Prothrombin
Ligand
BDBM33610
Substrate
Boc-Val-Pro-Arg-AMC
Meas. Tech.
Thrombin 1536 HTS Dose Response Confirmation
pH
7.5±n/a
Temperature
296.15±n/a K
IC50
100±n/a nM
Citation
 PubChem, PC Thrombin 1536 HTS Dose Response Confirmation PubChem Bioassay (2008)[AID] 
Target
Name:
Prothrombin
Synonyms:
Activation peptide fragment 1 Coagulation factor II Prothrombin precursor Thrombin heavy chain | Thrombin light chain
Type:
Protein
Mol. Mass.:
70029.57
Organism:
Homo sapiens (Human)
Description:
P00734
Residue:
622
  
Inhibitor
Name:
BDBM33610
Synonyms:
1-[5-(2-furanylmethylamino)-3-phenyl-1,2,4-triazol-1-yl]-2-phenylethanone 1-[5-(furan-2-ylmethylamino)-3-phenyl-1,2,4-triazol-1-yl]-2-phenyl-ethanone MLS000115577 cid_3896375
Type:
Small organic molecule
Emp. Form.:
C21H18N4O2
Mol. Mass.:
358.3932
SMILES:
O=C(Cc1ccccc1)n1nc(nc1NCc1ccco1)-c1ccccc1
:
Substrate
Name:
Boc-Val-Pro-Arg-AMC
Synonyms:
Type:
fluorogenic substrate
Mol. Mass.:
358.43
Organism:
Description:
Residue:
3
NA