Target
Prothrombin
Ligand
BDBM32697
Substrate
Boc-Val-Pro-Arg-AMC
Meas. Tech.
Thrombin 1536 HTS Dose Response Confirmation
pH
7.5±n/a
Temperature
296.15±n/a K
IC50
82±n/a nM
Citation
 PubChem, PC Thrombin 1536 HTS Dose Response Confirmation PubChem Bioassay (2008)[AID] 
Target
Name:
Prothrombin
Synonyms:
Activation peptide fragment 1 Coagulation factor II Prothrombin precursor Thrombin heavy chain | Thrombin light chain
Type:
Protein
Mol. Mass.:
70029.57
Organism:
Homo sapiens (Human)
Description:
P00734
Residue:
622
  
Inhibitor
Name:
BDBM32697
Synonyms:
(3-Furan-2-yl-5-methylsulfanyl-[1,2,4]triazol-1-yl)-phenyl-methanone SMR000120487 [3-(2-furyl)-5-(methylthio)-1,2,4-triazol-1-yl]-phenyl-methanone [3-(furan-2-yl)-5-methylsulfanyl-1,2,4-triazol-1-yl]-phenylmethanone | cid_1088427
Type:
Small organic molecule
Emp. Form.:
C14H11N3O2S
Mol. Mass.:
285.321
SMILES:
CSc1nc(nn1C(=O)c1ccccc1)-c1ccco1
:
Substrate
Name:
Boc-Val-Pro-Arg-AMC
Synonyms:
Type:
fluorogenic substrate
Mol. Mass.:
358.43
Organism:
Description:
Residue:
3
NA