Target
Prothrombin
Ligand
BDBM33719
Substrate
Boc-Val-Pro-Arg-AMC
Meas. Tech.
Thrombin 1536 HTS Dose Response Confirmation
pH
7.5±n/a
Temperature
296.15±n/a K
IC50
39.27±n/a nM
Citation
 PubChem, PC Thrombin 1536 HTS Dose Response Confirmation PubChem Bioassay (2008)[AID] 
Target
Name:
Prothrombin
Synonyms:
Activation peptide fragment 1 Coagulation factor II Prothrombin precursor Thrombin heavy chain | Thrombin light chain
Type:
Protein
Mol. Mass.:
70029.57
Organism:
Homo sapiens (Human)
Description:
P00734
Residue:
622
  
Inhibitor
Name:
BDBM33719
Synonyms:
2-[[2-[(6-methyl-1,3-benzothiazol-2-yl)amino]-2-oxoethyl]thio]acetic acid [2-(4-bromophenyl)-2-oxoethyl] ester MLS000563922 [(6-Methyl-benzothiazol-2-ylcarbamoyl)-methylsulfanyl]-acetic acid 2-(4-bromo-phenyl)-2-oxo-ethyl ester [2-(4-bromophenyl)-2-oxoethyl] 2-[2-[(6-methyl-1,3-benzothiazol-2-yl)amino]-2-oxoethyl]sulfanylacetate | cid_3132120
Type:
Small organic molecule
Emp. Form.:
C20H17BrN2O4S2
Mol. Mass.:
493.394
SMILES:
Cc1ccc2nc(NC(=O)CSCC(=O)OCC(=O)c3ccc(Br)cc3)sc2c1
:
Substrate
Name:
Boc-Val-Pro-Arg-AMC
Synonyms:
Type:
fluorogenic substrate
Mol. Mass.:
358.43
Organism:
Description:
Residue:
3
NA