Target
Prothrombin
Ligand
BDBM33789
Substrate
Boc-Val-Pro-Arg-AMC
Meas. Tech.
Thrombin 1536 HTS Dose Response Confirmation
pH
7.5±n/a
Temperature
296.15±n/a K
IC50
2.9±n/a nM
Citation
 PubChem, PC Thrombin 1536 HTS Dose Response Confirmation PubChem Bioassay (2008)[AID] 
Target
Name:
Prothrombin
Synonyms:
Activation peptide fragment 1 Coagulation factor II Prothrombin precursor Thrombin heavy chain | Thrombin light chain
Type:
Protein
Mol. Mass.:
70029.57
Organism:
Homo sapiens (Human)
Description:
P00734
Residue:
622
  
Inhibitor
Name:
BDBM33789
Synonyms:
1-[5-(benzylamino)-3-(3-pyridyl)-1,2,4-triazol-1-yl]propan-1-one 1-[5-[(phenylmethyl)amino]-3-(3-pyridinyl)-1,2,4-triazol-1-yl]-1-propanone MLS000719013 US9687479, 349 1-[5-(benzylamino)-3-(pyridin-3-yl)-1H-1,2,4-triazol-1-yl]propan-1-one | cid_4686951
Type:
Small organic molecule
Emp. Form.:
C17H17N5O
Mol. Mass.:
307.3498
SMILES:
CCC(=O)n1nc(nc1NCc1ccccc1)-c1cccnc1
:
Substrate
Name:
Boc-Val-Pro-Arg-AMC
Synonyms:
Type:
fluorogenic substrate
Mol. Mass.:
358.43
Organism:
Description:
Residue:
3
NA