Target
Prothrombin
Ligand
BDBM33808
Substrate
Boc-Val-Pro-Arg-AMC
Meas. Tech.
Thrombin 1536 HTS Dose Response Confirmation
pH
7.5±n/a
Temperature
296.15±n/a K
IC50
6±n/a nM
Citation
 PubChem, PC Thrombin 1536 HTS Dose Response Confirmation PubChem Bioassay (2008)[AID] 
Target
Name:
Prothrombin
Synonyms:
Activation peptide fragment 1 Coagulation factor II Prothrombin precursor Thrombin heavy chain | Thrombin light chain
Type:
Protein
Mol. Mass.:
70029.57
Organism:
Homo sapiens (Human)
Description:
P00734
Residue:
622
  
Inhibitor
Name:
BDBM33808
Synonyms:
2-methyl-1-[3-(3-pyridinyl)-5-(thiophen-2-ylmethylamino)-1,2,4-triazol-1-yl]-1-propanone 2-methyl-1-[3-pyridin-3-yl-5-(thiophen-2-ylmethylamino)-1,2,4-triazol-1-yl]propan-1-one SMR000291280 | cid_3961312
Type:
Small organic molecule
Emp. Form.:
C16H17N5OS
Mol. Mass.:
327.404
SMILES:
CC(C)C(=O)n1nc(nc1NCc1cccs1)-c1cccnc1
:
Substrate
Name:
Boc-Val-Pro-Arg-AMC
Synonyms:
Type:
fluorogenic substrate
Mol. Mass.:
358.43
Organism:
Description:
Residue:
3
NA