Target
Prothrombin
Ligand
BDBM33930
Substrate
Boc-Val-Pro-Arg-AMC
Meas. Tech.
Thrombin 1536 HTS Dose Response Confirmation
pH
7.5±n/a
Temperature
296.15±n/a K
IC50
82.05±n/a nM
Citation
 PubChem, PC Thrombin 1536 HTS Dose Response Confirmation PubChem Bioassay (2008)[AID] 
Target
Name:
Prothrombin
Synonyms:
Activation peptide fragment 1 Coagulation factor II Prothrombin precursor Thrombin heavy chain | Thrombin light chain
Type:
Protein
Mol. Mass.:
70029.57
Organism:
Homo sapiens (Human)
Description:
P00734
Residue:
622
  
Inhibitor
Name:
BDBM33930
Synonyms:
3-[(2-bromobenzoyl)amino]-1H-1,2,4-triazole-5-carboxylic acid methyl ester MLS001032861 cid_2314187 methyl 3-[(2-bromophenyl)carbonylamino]-1H-1,2,4-triazole-5-carboxylate
Type:
Small organic molecule
Emp. Form.:
C11H9BrN4O3
Mol. Mass.:
325.118
SMILES:
COC(=O)c1nnc(NC(=O)c2ccccc2Br)[nH]1
:
Substrate
Name:
Boc-Val-Pro-Arg-AMC
Synonyms:
Type:
fluorogenic substrate
Mol. Mass.:
358.43
Organism:
Description:
Residue:
3
NA