Target
Serine/threonine-protein kinase Chk2 [209-531,Q209M]
Ligand
BDBM34063
Substrate
Histone H1
Meas. Tech.
In Vitro Protein Kinase Assay
pH
7.5±n/a
Temperature
303.15±n/a K
IC50
240±n/a nM
Citation
 Jobson, AGCardellina, JHScudiero, DKondapaka, SZhang, HKim, HShoemaker, RPommier, Y Identification of a Bis-guanylhydrazone [4,4'-Diacetyldiphenylurea-bis(guanylhydrazone); NSC 109555] as a novel chemotype for inhibition of Chk2 kinase. Mol Pharmacol 72:876-84 (2007)  
Target
Name:
Serine/threonine-protein kinase Chk2 [209-531,Q209M]
Synonyms:
CDS1 CHK2 Checkpoint Kinase (Chk2) RAD53
Type:
Serine/threonine-protein kinase
Mol. Mass.:
36511.81
Organism:
Homo sapiens (Human)
Description:
O96017[209-531,Q209M]
Residue:
323
  
Inhibitor
Name:
BDBM34063
Synonyms:
DDUG diacetyldiphenylurea bisguanylhydrazone
Type:
Small organic molecule
Emp. Form.:
C19H24N10O
Mol. Mass.:
408.4603
SMILES:
[#6]-[#6](=[#7]\[#7]=[#6](/[#7])-[#7])-c1ccc(-[#7]-[#6](=O)-[#7]-c2ccc(cc2)-[#6](-[#6])=[#7]\[#7]=[#6](/[#7])-[#7])cc1
:
Substrate
Name:
Histone H1
Synonyms:
Type:
Other Protein Type
Mol. Mass.:
358.43
Organism:
Bos taurus (bovine)
Description:
Residue:
3
NA