Target
Gag-Pol polyprotein
Ligand
BDBM34395
Substrate
RNA/DNA hybrid
Meas. Tech.
HIV-1 RT-RNase H MLSCN MH077605 Probe Assessment: Dose response Assay
pH
8±n/a
Temperature
296.15±n/a K
IC50
5116.000175±n/a nM
Citation
 PubChem, PC HIV-1 RT-RNase H MLSCN MH077605 Probe Assessment: Dose response Assay PubChem Bioassay (2007)[AID] 
Target
Name:
Gag-Pol polyprotein
Synonyms:
HIV-1 reverse transcriptase (HIV-1 RT) POL_HV1H2 Protease Reverse transcriptase (RT) gag-pol p66 RT
Type:
Protein
Mol. Mass.:
162074.74
Organism:
Human immunodeficiency virus type 1 group M subtype B (isolate HXB2)
Description:
P04585
Residue:
1435
  
Inhibitor
Name:
BDBM34395
Synonyms:
4-amino-3-(2-methoxyphenyl)-2-sulfanylidene-1,3-thiazole-5-carboxamide 4-amino-3-(2-methoxyphenyl)-2-thioxo-2,3-dihydro-1,3-thiazole-5-carboxamide 4-azanyl-3-(2-methoxyphenyl)-2-sulfanylidene-1,3-thiazole-5-carboxamide SMR000019507 | cid_3243618
Type:
Small organic molecule
Emp. Form.:
C11H11N3O2S2
Mol. Mass.:
281.354
SMILES:
COc1ccccc1-n1c(N)c(sc1=S)C(N)=O
:
Substrate
Name:
RNA/DNA hybrid
Synonyms:
Type:
fluorescein-labeled RNA annealed to DNA
Mol. Mass.:
358.43
Organism:
Description:
It is a 18-nucleotide 3-fluorescein-labeled RNA annealed to a complementary 18-nucleotide 5-Dabcyl-modified DNA.
Residue:
3
NA