Target
Dual specificity tyrosine-phosphorylation-regulated kinase 1B
Ligand
BDBM401539
Substrate
Meas. Tech.
Kinase Assay
IC50
1.49±n/a nM
Citation
 Leban, JZaja, M 2,3-dihydrobenzofuran-5YL compounds as DYRK kinase inhibitors US Patent  US10005769 Publication Date 6/26/2018 
Target
Name:
Dual specificity tyrosine-phosphorylation-regulated kinase 1B
Synonyms:
DYR1B_HUMAN Dual specificity tyrosine-phosphorylation-regulated kinase 1B MIRK
Type:
Enzyme
Mol. Mass.:
69222.24
Organism:
Homo sapiens (Human)
Description:
Q9Y463
Residue:
629
  
Inhibitor
Name:
BDBM401539
Synonyms:
US10005769, No. 3
Type:
Small organic molecule
Emp. Form.:
C20H16N4O4S2
Mol. Mass.:
440.495
SMILES:
CS(=O)(=O)c1ccc2[nH]c(NC(=O)c3csc(n3)-c3ccc4OCCc4c3)nc2c1
: