Target
Dual specificity tyrosine-phosphorylation-regulated kinase 1B
Ligand
BDBM401559
Substrate
Meas. Tech.
Kinase Assay
IC50
0.699±n/a nM
Citation
 Leban, JZaja, M 2,3-dihydrobenzofuran-5YL compounds as DYRK kinase inhibitors US Patent  US10005769 Publication Date 6/26/2018 
Target
Name:
Dual specificity tyrosine-phosphorylation-regulated kinase 1B
Synonyms:
DYR1B_HUMAN Dual specificity tyrosine-phosphorylation-regulated kinase 1B MIRK
Type:
Enzyme
Mol. Mass.:
69222.24
Organism:
Homo sapiens (Human)
Description:
Q9Y463
Residue:
629
  
Inhibitor
Name:
BDBM401559
Synonyms:
US10005769, No. 23
Type:
Small organic molecule
Emp. Form.:
C23H21N5O4S
Mol. Mass.:
463.509
SMILES:
COCCNC(=O)c1ccc2[nH]c(NC(=O)c3csc(n3)-c3ccc4OCCc4c3)nc2c1
: