Target
Dual specificity tyrosine-phosphorylation-regulated kinase 1B
Ligand
BDBM401578
Substrate
Meas. Tech.
Kinase Assay
IC50
2.06±n/a nM
Citation
 Leban, JZaja, M 2,3-dihydrobenzofuran-5YL compounds as DYRK kinase inhibitors US Patent  US10005769 Publication Date 6/26/2018 
Target
Name:
Dual specificity tyrosine-phosphorylation-regulated kinase 1B
Synonyms:
DYR1B_HUMAN Dual specificity tyrosine-phosphorylation-regulated kinase 1B MIRK
Type:
Enzyme
Mol. Mass.:
69222.24
Organism:
Homo sapiens (Human)
Description:
Q9Y463
Residue:
629
  
Inhibitor
Name:
BDBM401578
Synonyms:
US10005769, No. 42
Type:
Small organic molecule
Emp. Form.:
C19H14N6O2S
Mol. Mass.:
390.418
SMILES:
O=C(Nc1nc(n[nH]1)-c1ccncc1)c1csc(n1)-c1ccc2OCCc2c1
: