Target
Cathepsin B
Ligand
BDBM34163
Substrate
Z-Arg-Arg-AMC
Meas. Tech.
Cathepsin B mixture HTS dose-response confirmation
pH
6.8±n/a
Temperature
296.15±n/a K
IC50
1639.48±n/a nM
Citation
 PubChem, PC Cathepsin B mixture HTS dose-response confirmation  PubChem Bioassay (2008)[AID] 
Target
Name:
Cathepsin B
Synonyms:
APP secretase CATB_HUMAN CTSB Cathepsin B light chain | Cathepsin B1
Type:
Enzyme
Mol. Mass.:
37819.69
Organism:
Homo sapiens (Human)
Description:
gi_63102437
Residue:
339
  
Inhibitor
Name:
BDBM34163
Synonyms:
3-Amino-7-benzyl-1-thioxo-5,6,7,8-tetrahydro-1H-thiopyrano[3,4-c]pyridine-4-carbonitrile 3-amino-7-benzyl-1-sulfanylidene-6,8-dihydro-5H-thiopyrano[3,4-c]pyridine-4-carbonitrile 3-azanyl-7-(phenylmethyl)-1-sulfanylidene-6,8-dihydro-5H-thiopyrano[3,4-c]pyridine-4-carbonitrile SMR000011772 | cid_787437
Type:
Small organic molecule
Emp. Form.:
C16H15N3S2
Mol. Mass.:
313.44
SMILES:
Nc1sc(=S)c2CN(Cc3ccccc3)CCc2c1C#N
:
Substrate
Name:
Z-Arg-Arg-AMC
Synonyms:
Benzyloxycarbonyl- L-arginyl- L-arginine- 4-methylcoumaryl-7-amide
Type:
fluorogenic substrate
Mol. Mass.:
358.43
Organism:
Description:
Residue:
3
NA