Target
Cyclin-A2/Cyclin-dependent kinase 2
Ligand
BDBM35657
Substrate
CDK2 Peptide Subsrate
Meas. Tech.
Ki Determination
Ki
852±n/a nM
Citation
 Aronov, AMTang, QMartinez-Botella, GBemis, GWCao, JChen, GEwing, NPFord, PJGermann, UAGreen, JHale, MRJacobs, MJanetka, JWMaltais, FMarkland, WNamchuk, MNNanthakumar, SPoondru, SStraub, Jter Haar, EXie, X Structure-guided design of potent and selective pyrimidylpyrrole inhibitors of extracellular signal-regulated kinase (ERK) using conformational control. J Med Chem 52:6362-8 (2009)  
Target
Name:
Cyclin-A2/Cyclin-dependent kinase 2
Synonyms:
CDK2-CyclinA CDK2/Cyclin A Cyclin A2/dependent kinase 2 Cyclin-Dependent Kinase 2 (CDK2A)
Type:
Protein Complex
Mol. Mass.:
Description:
Cdk2/Cyclin A kinase was purified from insect cells coinfected with Cyclin A/Cdk2 baculovirus.
Components:
This complex has 2 components.
Component 1
Name:
Cyclin-dependent kinase 2
Synonyms:
CDK2 CDK2_HUMAN Cell division protein kinase 2 Protein cereblon/Cyclin-dependent kinase 2 | p33 protein kinase
Type:
Enzyme Subunit
Mol. Mass.:
33938.17
Organism:
Homo sapiens (Human)
Description:
P24941
Residue:
298
  
Component 2
Name:
Cyclin-A2
Synonyms:
CCN1 CCNA1 CCNA2_HUMAN Cyclin-A
Type:
Enzyme Subunit
Mol. Mass.:
48550.19
Organism:
Homo sapiens (Human)
Description:
P20248
Residue:
432
  
Inhibitor
Name:
BDBM35657
Synonyms:
pyrimidylpyrrole, 11e
Type:
Small organic molecule
Emp. Form.:
C24H20Cl2FN5O2
Mol. Mass.:
500.352
SMILES:
Cc1cnc(Nc2ccc(F)cc2Cl)nc1-c1c[nH]c(c1)C(=O)N[C@H](CO)c1cccc(Cl)c1
:
Substrate
Name:
CDK2 Peptide Subsrate
Synonyms:
Type:
Peptide
Mol. Mass.:
358.43
Organism:
Description:
Residue:
3
NA