Target
Interferon-induced, double-stranded RNA-activated protein kinase
Ligand
BDBM308050
Substrate
Meas. Tech.
KinaseGlo Assay
IC50
140±n/a nM
Citation
 Boral, SMalone, TCWang, SRao, SYang, R Heterocycle-substituted pyridyl benzothiophenes as kinase inhibitors US Patent  US10011593 Publication Date 7/3/2018 
Target
Name:
Interferon-induced, double-stranded RNA-activated protein kinase
Synonyms:
E2AK2_HUMAN Eukaryotic translation initiation factor 2-alpha kinase 2 P1/eIF-2A protein kinase PRKR Protein kinase RNA-activated eIF-2A protein kinase 2 | p68 kinase
Type:
PROTEIN
Mol. Mass.:
62104.61
Organism:
Homo sapiens (Human)
Description:
ChEMBL_1467743
Residue:
551
  
Inhibitor
Name:
BDBM308050
Synonyms:
US10011593, Ex. 2 | US9650366, 2
Type:
Small organic molecule
Emp. Form.:
C22H14ClF3N8OS
Mol. Mass.:
530.913
SMILES:
Nc1ncc(cc1-c1cc2cc(NC(=O)Nc3ccc(Cl)c(c3)C(F)(F)F)ccc2s1)-c1nn[nH]n1
: