Target
Histone deacetylase 5
Ligand
BDBM402284
Substrate
Meas. Tech.
Biochemical Assay
IC50
508±n/a nM
Citation
 Ma, HWang, Y Histone deacetylase inhibitors and methods for use thereof US Patent  US10011611 Publication Date 7/3/2018 
Target
Name:
Histone deacetylase 5
Synonyms:
Antigen NY-CO-9 HDAC5 Histone acetylase 5 (HDAC5) Human HDAC5 | KIAA0600
Type:
Enzyme
Mol. Mass.:
121968.61
Organism:
Homo sapiens (Human)
Description:
Q9UQL6
Residue:
1122
  
Inhibitor
Name:
BDBM402284
Synonyms:
(N-hydroxy-4-((3-oxoisothiazolo[5,4-b]pyridin-2(3H)-yl)methyl)benzamide) | US10011611, RBC-3001-A
Type:
Small organic molecule
Emp. Form.:
C14H11N3O3S
Mol. Mass.:
301.32
SMILES:
ONC(=O)c1ccc(Cn2sc3ncccc3c2=O)cc1
: