Target
Phospholipase D1
Ligand
BDBM50206160
Substrate
Meas. Tech.
PLD2 In Vitro Enzymatic Assay
Temperature
310.15±0 K
IC50
310±0.0 nM
Citation
 Scott, SASelvy, PEBuck, JRCho, HPCriswell, TLThomas, ALArmstrong, MDArteaga, CLLindsley, CWBrown, HA Design of isoform-selective phospholipase D inhibitors that modulate cancer cell invasiveness. Nat Chem Biol 5:108-17 (2009)  
Target
Name:
Phospholipase D1
Synonyms:
Choline phosphatase 1 PLD1 Phosphatidylcholine-hydrolyzing phospholipase D1 Phospholipase D1 Phospholipase D2 (PLD2) | hPLD1
Type:
Protein
Mol. Mass.:
124219.92
Organism:
Homo sapiens (Human)
Description:
Q13393
Residue:
1074
  
Inhibitor
Name:
BDBM50206160
Synonyms:
CHEMBL245621 Halopemide, 8 N-(2-(4-(5-chloro-2-oxo-2,3-dihydrobenzo[d]imidazol-1-yl)piperidin-1-yl)ethyl)-4-fluorobenzamide | cid_65490
Type:
Small organic molecule
Emp. Form.:
C21H22ClFN4O2
Mol. Mass.:
416.876
SMILES:
Fc1ccc(cc1)C(=O)NCCN1CCC(CC1)n1c2ccc(Cl)cc2[nH]c1=O
: