Target
Uracil-DNA glycosylase
Ligand
BDBM36453
Substrate
BDBM36458
Meas. Tech.
UNG Inhibition Assay
pH
8±0
IC50
1.3e+3±n/a nM
Citation
 Chung, SParker, JBBianchet, MAmzel, LMStivers, JT Impact of linker strain and flexibility in the design of a fragment-based inhibitor. Nat Chem Biol 5:407-13 (2009)  
Target
Name:
Uracil-DNA glycosylase
Synonyms:
DGU UNG UNG15 Uracil-DNA glycosylase (UNG)
Type:
Protein
Mol. Mass.:
34661.15
Organism:
Homo sapiens (Human)
Description:
P1305
Residue:
313
  
Inhibitor
Name:
BDBM36453
Synonyms:
6-[3-[(3-Carboxy-benzylidene)aminooxypropylamino]-methyl]uracil, 6 | CID25210526
Type:
Small organic molecule
Emp. Form.:
C16H18N4O5
Mol. Mass.:
346.3379
SMILES:
OC(=O)c1cccc(\C=N\OCCCNCc2cc(=O)[nH]c(=O)[nH]2)c1
:
Substrate
Name:
BDBM36458
Synonyms:
6-Formyluracil, 11 | CID70951
Type:
Substrate
Emp. Form.:
C5H4N2O3
Mol. Mass.:
140.0969
SMILES:
O=Cc1cc(=O)[nH]c(=O)[nH]1
: