Target
Beta-hexosaminidase subunit beta
Ligand
BDBM36550
Substrate
BDBM18365
Meas. Tech.
Enzyme Inhibition Assay
pH
4.25±0
Temperature
303.15±0 K
Ki
1.7e+3± 5.6e+2 nM
Citation
 Ho, CWPopat, SDLiu, TWTsai, KCHo, MJChen, WHYang, ASLin, CH Development of GlcNAc-inspired iminocyclitiols as potent and selective N-acetyl-beta-hexosaminidase inhibitors. ACS Chem Biol 5:489-97 (2010)  
Target
Name:
Beta-hexosaminidase subunit beta
Synonyms:
Beta-N-acetylhexosaminidase subunit beta Beta-hexosaminidase subunit beta (Hex B) HEXB_HUMAN | Hexosaminidase subunit B
Type:
Enzyme
Mol. Mass.:
63112.58
Organism:
Homo sapiens (Human)
Description:
P07686
Residue:
556
  
Inhibitor
Name:
BDBM36550
Synonyms:
N-[1-(7-azidoheptyl)-4,5-dihydroxy-6-(hydroxymethyl)piperidin-3-yl]acetamide, 5
Type:
Small organic molecule
Emp. Form.:
C15H29N5O4
Mol. Mass.:
343.4219
SMILES:
CC(=O)NC1CN(CCCCCCCN=[N]#N)C(CO)C(O)C1O
:
Substrate
Name:
BDBM18365
Synonyms:
4-Methylumbelliferyl alpha-D-glucopyranoside 4-methylumbelliferyl alpha-glucoside
Type:
Small organic molecule
Emp. Form.:
C16H18O8
Mol. Mass.:
338.3093
SMILES:
Cc1cc(=O)oc2cc(O[C@H]3O[C@H](CO)[C@@H](O)[C@H](O)[C@H]3O)ccc12
: