Target
Cathepsin D
Ligand
BDBM36562
Substrate
Meas. Tech.
High Through-Put Fluorescence Assay
pH
3.7±0
Ki
131±12 nM
Citation
 Kick, EKRoe, DCSkillman, AGLiu, GEwing, TJSun, YKuntz, IDEllman, JA Structure-based design and combinatorial chemistry yield low nanomolar inhibitors of cathepsin D. Chem Biol 4:297-307 (1997)  
Target
Name:
Cathepsin D
Synonyms:
CATD_HUMAN CTSD Cathepsin D heavy chain Cathepsin D precursor
Type:
Enzyme
Mol. Mass.:
44551.72
Organism:
Homo sapiens (Human)
Description:
Human proCathepsin D (SwissProt accession number P07339) was expressed in Sf9 cells, purified, and autoactivated.
Residue:
412
  
Inhibitor
Name:
BDBM36562
Synonyms:
EHA
Type:
Small organic molecule
Emp. Form.:
C39H36N4O9
Mol. Mass.:
704.7245
SMILES:
OC(CN(CCc1ccc2OCOc2c1)C(=O)CCN1C(=O)c2ccccc2C1=O)[C@@H](NC(=O)CCn1c2ccccc2oc1=O)c1ccccc1
: