Target
Tyrosine-protein kinase Fes/Fps
Ligand
BDBM31090
Substrate
Meas. Tech.
Kinase Inhibitor Selectivity Profiling Assay
Kd
5700±n/a nM
Citation
 PubChem, PC Kinase Inhibitor Selectivity Profiling Assay PubChem Bioassay (2008)[AID] 
Target
Name:
Tyrosine-protein kinase Fes/Fps
Synonyms:
FES FPS Tyrosine-protein kinase Fes/Fps
Type:
Enzyme
Mol. Mass.:
93498.99
Organism:
Homo sapiens (Human)
Description:
P07332
Residue:
822
  
Inhibitor
Name:
BDBM31090
Synonyms:
(E)-N-[4-(3-chloro-4-fluoro-anilino)-3-cyano-7-ethoxy-6-quinolyl]-4-(dimethylamino)but-2-enamide (E)-N-[4-(3-chloro-4-fluoroanilino)-3-cyano-7-ethoxyquinolin-6-yl]-4-(dimethylamino)but-2-enamide EKB-569 cid_6445562
Type:
Small organic molecule
Emp. Form.:
C24H23ClFN5O2
Mol. Mass.:
467.923
SMILES:
CCOc1cc2ncc(C#N)c(Nc3ccc(F)c(Cl)c3)c2cc1NC(=O)\C=C\CN(C)C
: