Target
Tyrosine-protein kinase HCK
Ligand
BDBM4779
Substrate
Meas. Tech.
Kinase Inhibitor Selectivity Profiling Assay
Kd
4200±n/a nM
Citation
 PubChem, PC Kinase Inhibitor Selectivity Profiling Assay PubChem Bioassay (2008)[AID] 
Target
Name:
Tyrosine-protein kinase HCK
Synonyms:
HCK Hematopoietic cell kinase p59-HCK/p60-HCK p61Hck
Type:
Enzyme Catalytic Domain
Mol. Mass.:
59600.18
Organism:
Homo sapiens (Human)
Description:
P08631
Residue:
526
  
Inhibitor
Name:
BDBM4779
Synonyms:
CHEMBL31965 CI-1033 N-{4-[(3-chloro-4-fluorophenyl)amino]-7-[3-(morpholin-4-yl)propoxy]quinazolin-6-yl}prop-2-enamide US10507209, Compound CI-1033 cid_156414
Type:
Small organic molecule
Emp. Form.:
C24H25ClFN5O3
Mol. Mass.:
485.938
SMILES:
Fc1ccc(Nc2ncnc3cc(OCCCN4CCOCC4)c(NC(=O)C=C)cc23)cc1Cl
: