Target
Serine/threonine-protein kinase MRCK beta
Ligand
BDBM31096
Substrate
Meas. Tech.
Kinase Inhibitor Selectivity Profiling Assay
Kd
42±n/a nM
Citation
 PubChem, PC Kinase Inhibitor Selectivity Profiling Assay PubChem Bioassay (2008)[AID] 
Target
Name:
Serine/threonine-protein kinase MRCK beta
Synonyms:
CDC42BPB MRCKB Myotonic dystrophy kinase-related CDC42-binding kinase beta
Type:
Protien
Mol. Mass.:
194307.09
Organism:
Homo sapiens (Human)
Description:
Q9Y5S2
Residue:
1711
  
Inhibitor
Name:
BDBM31096
Synonyms:
CHEMBL290084 cid_451705
Type:
Small organic molecule
Emp. Form.:
C28H26N4O3
Mol. Mass.:
466.531
SMILES:
CN[C@H]1C[C@@H]2O[C@](C)([C@H]1OC)n1c3ccccc3c3c4CNC(=O)c4c4c5ccccc5n2c4c13
: